Reaction Details
TargetMelanocortin receptor 5
LigandBDBM50114078
Substrate/Competitorn/a
Meas. Tech.ChEMBL_106519 (CHEMBL713023)
EC50 1±n/a nM
Citation Kavarana, MJTrivedi, DCai, MYing, JHammer, MCabello, CGrieco, PHan, GHruby, VJ Novel cyclic templates of alpha-MSH give highly selective and potent antagonists/agonists for human melanocortin-3/4 receptors. J Med Chem45:2644-50 (2002) Melanocortin receptor 5
Name:Melanocortin receptor 5
Type:Enzyme
Mol. Mass.:36612.92
Organism:Homo sapiens (Human)
Description:P33032
Residue:325
BDBM50114078
NameBDBM50114078
Synonyms:8-(3-Guanidino-propyl)-2-(3H-imidazol-4-ylmethyl)-11-(1H-indol-3-ylmethyl)-5-naphthalen-2-ylmethyl-3,6,9,12,20,24-hexaoxo-1,4,7,10,13,19hexaaza-cyclotetracosane-14-carboxylic acid amide | CHEMBL313279
TypeSmall organic molecule
Emp. Form.C47H59N13O7
Mol. Mass.918.0543
SMILESNC(=N)NCCC[C@@H]1NC(=O)[C@@H](Cc2ccc3ccccc3c2)NC(=O)[C@H](Cc2cnc[nH]2)NC(=O)CCCC(=O)NCCCC[C@@H](NC(=O)[C@@H](Cc2c[nH]c3ccccc23)NC1=O)C(N)=O