Reaction Details
TargetMelanocortin receptor 5
LigandBDBM50114087
Substrate/Competitorn/a
Meas. Tech.ChEMBL_106653 (CHEMBL712998)
Ki 660±n/a nM
Citation Kavarana, MJTrivedi, DCai, MYing, JHammer, MCabello, CGrieco, PHan, GHruby, VJ Novel cyclic templates of alpha-MSH give highly selective and potent antagonists/agonists for human melanocortin-3/4 receptors. J Med Chem45:2644-50 (2002) Melanocortin receptor 5
Name:Melanocortin receptor 5
Type:Enzyme
Mol. Mass.:36612.92
Organism:Homo sapiens (Human)
Description:P33032
Residue:325
BDBM50114087
NameBDBM50114087
Synonyms:9-Benzyl-6-(3-guanidino-propyl)-12-(3H-imidazol-4-ylmethyl)-3-(1H-indol-3-ylmethyl)-2,5,8,11,14,17-hexaoxo-1,4,7,10,13,18hexaaza-cyclotricosane-23-carboxylic acid amide | CHEMBL91041
TypeSmall organic molecule
Emp. Form.C42H55N13O7
Mol. Mass.853.969
SMILESNC(=N)NCCC[C@@H]1NC(=O)[C@@H](Cc2ccccc2)NC(=O)[C@H](Cc2cnc[nH]2)NC(=O)CCC(=O)NCCCC[C@@H](NC(=O)[C@@H](Cc2c[nH]c3ccccc23)NC1=O)C(N)=O