Reaction Details
TargetSeed linoleate 13S-lipoxygenase-1
LigandBDBM50114094
Substrate/Competitorn/a
Meas. Tech.ChEMBL_169 (CHEMBL615381)
IC50 57±n/a nM
Citation Whitman, SGezginci, MTimmermann, BNHolman, TR Structure-activity relationship studies of nordihydroguaiaretic acid inhibitors toward soybean, 12-human, and 15-human lipoxygenase. J Med Chem45:2659-61 (2002) Seed linoleate 13S-lipoxygenase-1
Name:Seed linoleate 13S-lipoxygenase-1
Type:Enzyme
Mol. Mass.:94365.66
Organism:Glycine max (soybean)
Description:n/a
Residue:839
BDBM50114094
NameBDBM50114094
Synonyms:4-bromo-5-[(2R,3S)-4-(2-bromo-4,5-dihydroxyphenyl)-2,3-dimethylbutyl]benzene-1,2-diol | CHEMBL89283
TypeSmall organic molecule
Emp. Form.C18H20Br2O4
Mol. Mass.460.157
SMILESC[C@@H](Cc1cc(O)c(O)cc1Br)[C@H](C)Cc1cc(O)c(O)cc1Br