Reaction Details
TargetPolyunsaturated fatty acid lipoxygenase ALOX12
LigandBDBM50114094
Substrate/Competitorn/a
Meas. Tech.ChEMBL_209 (CHEMBL615243)
IC50 430±n/a nM
Citation Whitman, SGezginci, MTimmermann, BNHolman, TR Structure-activity relationship studies of nordihydroguaiaretic acid inhibitors toward soybean, 12-human, and 15-human lipoxygenase. J Med Chem45:2659-61 (2002) Polyunsaturated fatty acid lipoxygenase ALOX12
Name:Polyunsaturated fatty acid lipoxygenase ALOX12
Type:Protein
Mol. Mass.:75689.18
Organism:Homo sapiens (Human)
Description:P18054
Residue:663
BDBM50114094
NameBDBM50114094
Synonyms:4-bromo-5-[(2R,3S)-4-(2-bromo-4,5-dihydroxyphenyl)-2,3-dimethylbutyl]benzene-1,2-diol | CHEMBL89283
TypeSmall organic molecule
Emp. Form.C18H20Br2O4
Mol. Mass.460.157
SMILESC[C@@H](Cc1cc(O)c(O)cc1Br)[C@H](C)Cc1cc(O)c(O)cc1Br