Reaction Details
TargetSodium/hydrogen exchanger 1
LigandBDBM50115236
Substrate/Competitorn/a
Meas. Tech.ChEMBL_141044 (CHEMBL746892)
IC50 32±n/a nM
Citation Fukumoto, SImamiya, EKusumoto, KFujiwara, SWatanabe, TShiraishi, M Novel, non-acylguanidine-type Na(+)/H(+) exchanger inhibitors: synthesis and pharmacology of 5-tetrahydroquinolinylidene aminoguanidine derivatives. J Med Chem45:3009-21 (2002) Sodium/hydrogen exchanger 1
Name:Sodium/hydrogen exchanger 1
Type:PROTEIN
Mol. Mass.:91655.00
Organism:Rattus norvegicus
Description:ChEMBL_862370
Residue:820
BDBM50115236
NameBDBM50115236
Synonyms:CHEMBL542925 | N-[7-(5-fluoro-2-methoxyphenyl)-4-methyl-5,6,7,8-tetrahydro-5-quinolinyliden(imine)]iminomethanediamine. dihydrochloride
TypeSmall organic molecule
Emp. Form.C18H20FN5O
Mol. Mass.341.3827
SMILES[#6]-[#8]-c1ccc(F)cc1-[#6]-1-[#6]-[#6](=[#7]\[#7]=[#6](\[#7])-[#7])-c2c(-[#6])ccnc2-[#6]-1