Reaction Details
TargetD(2) dopamine receptor
LigandBDBM50115274
Substrate/Competitorn/a
Meas. Tech.ChEMBL_60235 (CHEMBL671417)
Ki 439±n/a nM
Citation Dijkstra, DRodenhuis, NVermeulen, ESPugsley, TAWise, LDWikström, HV Further characterization of structural requirements for ligands at the dopamine D(2) and D(3) receptor: exploring the thiophene moiety. J Med Chem45:3022-31 (2002) D(2) dopamine receptor
Name:D(2) dopamine receptor
Type:Cell-surface receptors
Mol. Mass.:50647.10
Organism:Homo sapiens (Human)
Description:P14416
Residue:443
BDBM50115274
NameBDBM50115274
Synonyms:CHEMBL105623 | Propyl-bis-(2-thiophen-3-yl-ethyl)-amine
TypeSmall organic molecule
Emp. Form.C15H21NS2
Mol. Mass.279.464
SMILESCCCN(CCc1ccsc1)CCc1ccsc1