Reaction Details
TargetD(3) dopamine receptor
LigandBDBM50115281
Substrate/Competitorn/a
Meas. Tech.ChEMBL_62294 (CHEMBL872893)
Ki 240±n/a nM
Citation Dijkstra, DRodenhuis, NVermeulen, ESPugsley, TAWise, LDWikström, HV Further characterization of structural requirements for ligands at the dopamine D(2) and D(3) receptor: exploring the thiophene moiety. J Med Chem45:3022-31 (2002) D(3) dopamine receptor
Name:D(3) dopamine receptor
Type:n/a
Mol. Mass.:44243.43
Organism:Homo sapiens (Human)
Description:n/a
Residue:400
BDBM50115281
NameBDBM50115281
Synonyms:6-Propyl-4,5a,6,7,8,9a-hexahydro-5H-9-oxa-3-thia-6-aza-cyclopenta[a]naphthalene | CHEMBL102632
TypeSmall organic molecule
Emp. Form.C13H19NOS
Mol. Mass.237.361
SMILESCCCN1CCOC2C1CCc1sccc21