Reaction Details
TargetMelanocortin receptor 3
LigandBDBM50115362
Substrate/Competitorn/a
Meas. Tech.ChEMBL_106844 (CHEMBL713185)
Ki 295±n/a nM
Citation Holder, JRBauzo, RMXiang, ZHaskell-Luevano, C Structure-activity relationships of the melanocortin tetrapeptide Ac-His-DPhe-Arg-Trp-NH(2) at the mouse melanocortin receptors: part 2 modifications at the Phe position. J Med Chem45:3073-81 (2002) Melanocortin receptor 3
Name:Melanocortin receptor 3
Type:PROTEIN
Mol. Mass.:35808.24
Organism:Mus musculus
Description:ChEMBL_1498848
Residue:323
BDBM50115362
NameBDBM50115362
Synonyms:2-{2-[2-Acetylamino-3-(3H-imidazol-4-yl)-propionylamino]-3-naphthalen-2-yl-propionylamino}-5-guanidino-pentanoic acid [1-carbamoyl-2-(1H-indol-3-yl)-ethyl]-amide | CHEMBL103817
TypeSmall organic molecule
Emp. Form.C38H45N11O5
Mol. Mass.735.8346
SMILESCC(=O)N[C@@H](Cc1cnc[nH]1)C(=O)N[C@H](Cc1ccc2ccccc2c1)C(=O)N[C@@H](CCCNC(N)=N)C(=O)N[C@@H](Cc1c[nH]c2ccccc12)C(N)=O