Reaction Details
TargetMelanocortin receptor 3
LigandBDBM50121900
Substrate/Competitorn/a
Meas. Tech.ChEMBL_106841 (CHEMBL715427)
EC50 0.098±n/a nM
Citation Holder, JRBauzo, RMXiang, ZHaskell-Luevano, C Structure-activity relationships of the melanocortin tetrapeptide Ac-His-DPhe-Arg-Trp-NH(2) at the mouse melanocortin receptors: part 2 modifications at the Phe position. J Med Chem45:3073-81 (2002) Melanocortin receptor 3
Name:Melanocortin receptor 3
Type:PROTEIN
Mol. Mass.:35808.24
Organism:Mus musculus
Description:ChEMBL_1498848
Residue:323
BDBM50121900
NameBDBM50121900
Synonyms:Ac-Ser-Try-Ser-Nle-Glu-His-DPhe-Arg-Trp-Gly-Lys-Pro-Val-NH2 | CHEMBL439490
TypeSmall organic molecule
Emp. Form.C78H111N21O19
Mol. Mass.1646.8452
SMILESCCCC[C@H](NC(=O)C(CO)NC(=O)[C@H](Cc1ccc(O)cc1)NC(=O)[C@H](CO)NC(C)=O)C(=O)N[C@@H](CCC(O)=O)C(=O)N[C@@H](Cc1cnc[nH]1)C(=O)N[C@H](Cc1ccccc1)C(=O)N[C@@H](CCCNC(N)=N)C(=O)N[C@@H](Cc1c[nH]c2ccccc12)C(=O)NCC(=O)N[C@@H](CCCCN)C(=O)N1CCC[C@@H]1C(=O)N[C@H](C(C)C)C(N)=O