Reaction Details
TargetMetabotropic glutamate receptor 2
LigandBDBM17660
Substrate/Competitorn/a
Meas. Tech.ChEMBL_106056 (CHEMBL718222)
Ki 113000±n/a nM
Citation Bertrand, HOBessis, ASPin, JPAcher, FC Common and selective molecular determinants involved in metabotopic glutamate receptor agonist activity. J Med Chem45:3171-83 (2002) Metabotropic glutamate receptor 2
Name:Metabotropic glutamate receptor 2
Type:Enzyme
Mol. Mass.:95584.88
Organism:Homo sapiens (Human)
Description:Q14416
Residue:872
BDBM17660
NameBDBM17660
Synonyms:(2S)-2-amino-3-(3,5-dioxo-1,2,4-oxadiazolidin-2-yl)propanoic acid CHEMBL279956 Quisqualate, L | quisqualic acid
TypeSmall organic molecule
Emp. Form.C5H7N3O5
Mol. Mass.189.1262
SMILESN[C@@H](Cn1oc(=O)[nH]c1=O)C(O)=O