Reaction Details
TargetLeukotriene A-4 hydrolase
LigandBDBM50116537
Substrate/Competitorn/a
Meas. Tech.ChEMBL_90046 (CHEMBL701917)
IC50<0.50±n/a nM
Citation Penning, TDRussell, MAChen, BBChen, HYLiang, CDMahoney, MWMalecha, JWMiyashiro, JMYu, SSAskonas, LJGierse, JKHarding, EIHighkin, MKKachur, JFKim, SHVillani-Price, DPyla, EYGhoreishi-Haack, NSSmith, WG Synthesis of potent leukotriene A(4) hydrolase inhibitors. Identification of 3-[methyl[3-[4-(phenylmethyl)phenoxy]propyl]amino]propanoic acid. J Med Chem45:3482-90 (2002) Leukotriene A-4 hydrolase
Name:Leukotriene A-4 hydrolase
Type:Hydrolase; metalloprotease
Mol. Mass.:69280.41
Organism:Homo sapiens (Human)
Description:Human recombinant LTA4H.
Residue:611
BDBM50116537
NameBDBM50116537
Synonyms:3-({3-[4-(Biphenyl-4-yloxy)-phenoxy]-propyl}-methyl-amino)-propionic acid | CHEMBL119612
TypeSmall organic molecule
Emp. Form.C25H27NO4
Mol. Mass.405.4862
SMILESCN(CCCOc1ccc(Oc2ccc(cc2)-c2ccccc2)cc1)CCC(O)=O