Reaction Details
TargetReceptor-type tyrosine-protein kinase FLT3
LigandBDBM50117319
Substrate/Competitorn/a
Meas. Tech.ChEMBL_158682 (CHEMBL766072)
IC50 40±n/a nM
Citation Pandey, AVolkots, DLSeroogy, JMRose, JWYu, JCLambing, JLHutchaleelaha, AHollenbach, SJAbe, KGiese, NAScarborough, RM Identification of orally active, potent, and selective 4-piperazinylquinazolines as antagonists of the platelet-derived growth factor receptor tyrosine kinase family. J Med Chem45:3772-93 (2002) Receptor-type tyrosine-protein kinase FLT3
Name:Receptor-type tyrosine-protein kinase FLT3
Type:Enzyme
Mol. Mass.:112888.62
Organism:Homo sapiens (Human)
Description:P36888
Residue:993
BDBM50117319
NameBDBM50117319
Synonyms:4-[6-Methoxy-7-(3-morpholin-4-yl-propoxy)-quinazolin-4-yl]-piperazine-1-carboxylic acid (4-isopropoxy-phenyl)-amide | CHEMBL125898
TypeSmall organic molecule
Emp. Form.C30H40N6O5
Mol. Mass.564.6758
SMILESCOc1cc2c(ncnc2cc1OCCCN1CCOCC1)N1CCN(CC1)C(=O)Nc1ccc(OC(C)C)cc1