Reaction Details
TargetPlatelet-derived growth factor receptor beta
LigandBDBM50117335
Substrate/Competitorn/a
Meas. Tech.ChEMBL_158652 (CHEMBL763438)
IC50 190±n/a nM
Citation Pandey, AVolkots, DLSeroogy, JMRose, JWYu, JCLambing, JLHutchaleelaha, AHollenbach, SJAbe, KGiese, NAScarborough, RM Identification of orally active, potent, and selective 4-piperazinylquinazolines as antagonists of the platelet-derived growth factor receptor tyrosine kinase family. J Med Chem45:3772-93 (2002) Platelet-derived growth factor receptor beta
Name:Platelet-derived growth factor receptor beta
Type:Enzyme
Mol. Mass.:123922.25
Organism:Homo sapiens (Human)
Description:P09619
Residue:1106
BDBM50117335
NameBDBM50117335
Synonyms:4-[6,7-Bis-(2-methoxy-ethoxy)-quinazolin-4-yl]-piperazine-1-carboxylic acid [4-(4-bromo-phenoxy)-phenyl]-amide | CHEMBL125805
TypeSmall organic molecule
Emp. Form.C31H34BrN5O6
Mol. Mass.652.536
SMILESCOCCOc1cc2ncnc(N3CCN(CC3)C(=O)Nc3ccc(Oc4ccc(Br)cc4)cc3)c2cc1OCCOC