Reaction Details
TargetMast/stem cell growth factor receptor Kit
LigandBDBM13530
Substrate/Competitorn/a
Meas. Tech.ChEBML_158683
IC50 260±n/a nM
Citation Pandey, AVolkots, DLSeroogy, JMRose, JWYu, JCLambing, JLHutchaleelaha, AHollenbach, SJAbe, KGiese, NAScarborough, RM Identification of orally active, potent, and selective 4-piperazinylquinazolines as antagonists of the platelet-derived growth factor receptor tyrosine kinase family. J Med Chem45:3772-93 (2002) Mast/stem cell growth factor receptor Kit
Name:Mast/stem cell growth factor receptor Kit
Type:Protein
Mol. Mass.:109869.37
Organism:Homo sapiens (Human)
Description:P10721
Residue:976
BDBM13530
NameBDBM13530
Synonyms:4-[(4-methylpiperazin-1-yl)methyl]-N-[4-methyl-3-[(4-pyridin-3-ylpyrimidin-2-yl)amino]phenyl]benzamide Gleevec Imatinib, 21 STI-571 US10906896, Cpd imatinib US11725005, Compound imatinib cid_5291 med.21724, Compound 6
TypeSmall organic molecule
Emp. Form.C29H31N7O
Mol. Mass.493.6027
SMILESCN1CCN(Cc2ccc(cc2)C(=O)Nc2ccc(C)c(Nc3nccc(n3)-c3cccnc3)c2)CC1