Reaction Details
TargetNeutrophil elastase
LigandBDBM50118030
Substrate/Competitorn/a
Meas. Tech.ChEMBL_64138 (CHEMBL675302)
Ki 0.014±n/a nM
Citation Macdonald, SJDowle, MDHarrison, LAClarke, GDInglis, GGJohnson, MRShah, PSmith, RAAmour, AFleetwood, GHumphreys, DCMolloy, CRDixon, MGodward, REWonacott, AJSingh, OMHodgson, STHardy, GW Discovery of further pyrrolidine trans-lactams as inhibitors of human neutrophil elastase (HNE) with potential as development candidates and the crystal structure of HNE complexed with an inhibitor (GW475151). J Med Chem45:3878-90 (2002) Neutrophil elastase
Name:Neutrophil elastase
Type:Enzyme
Mol. Mass.:28532.38
Organism:Homo sapiens (Human)
Description:P08246
Residue:267
BDBM50118030
NameBDBM50118030
Synonyms:4-(5-Cyclopropylaminomethyl-pyrazine-2-carbonyl)-3-isopropyl-1-methanesulfonyl-hexahydro-pyrrolo[3,2-b]pyrrol-2-one; hydrochloride | CHEMBL543416
TypeSmall organic molecule
Emp. Form.C19H27N5O4S
Mol. Mass.421.514
SMILESCC(C)[C@H]1[C@H]2[C@@H](CCN2C(=O)c2cnc(CNC3CC3)cn2)N(C1=O)S(C)(=O)=O