Reaction Details
TargetNeuromedin-K receptor
LigandBDBM50118100
Substrate/Competitorn/a
Meas. Tech.ChEMBL_209570 (CHEMBL811272)
Ki 220±n/a nM
Citation Albert, JSAharony, DAndisik, DBarthlow, HBernstein, PRBialecki, RADedinas, RDembofsky, BTHill, DKirkland, KKoether, GMKosmider, BJOhnmacht, CPalmer, WPotts, WRumsey, WShen, LShenvi, ASherwood, SWarwick, PJRussell, K Design, synthesis, and SAR of tachykinin antagonists: modulation of balance in NK(1)/NK(2) receptor antagonist activity. J Med Chem45:3972-83 (2002) Neuromedin-K receptor
Name:Neuromedin-K receptor
Type:Enzyme
Mol. Mass.:52221.96
Organism:Homo sapiens (Human)
Description:P29371
Residue:465
BDBM50118100
NameBDBM50118100
Synonyms:3-Cyano-2-methoxy-naphthalene-1-carboxylic acid ((S)-2-(3,4-dichloro-phenyl)-4-{4-[2-((S)-methanesulfinyl)-phenyl]-piperidin-1-yl}-butyl)-methyl-amide CHEMBL129321
TypeSmall organic molecule
Emp. Form.C36H37Cl2N3O3S
Mol. Mass.662.668
SMILESCOc1c(cc2ccccc2c1C(=O)N(C)C[C@@H](CCN1CCC(CC1)c1ccccc1[S@](C)=O)c1ccc(Cl)c(Cl)c1)C#N