Reaction Details
TargetNeuromedin-K receptor
LigandBDBM50409575
Substrate/Competitorn/a
Meas. Tech.ChEMBL_209569 (CHEMBL811271)
Ki 9190±n/a nM
Citation Albert, JSAharony, DAndisik, DBarthlow, HBernstein, PRBialecki, RADedinas, RDembofsky, BTHill, DKirkland, KKoether, GMKosmider, BJOhnmacht, CPalmer, WPotts, WRumsey, WShen, LShenvi, ASherwood, SWarwick, PJRussell, K Design, synthesis, and SAR of tachykinin antagonists: modulation of balance in NK(1)/NK(2) receptor antagonist activity. J Med Chem45:3972-83 (2002) Neuromedin-K receptor
Name:Neuromedin-K receptor
Type:Enzyme
Mol. Mass.:52221.96
Organism:Homo sapiens (Human)
Description:P29371
Residue:465
BDBM50409575
NameBDBM50409575
Synonyms:CHEMBL339767 | ZD-7944
TypeSmall organic molecule
Emp. Form.C31H34Cl2N2O2S
Mol. Mass.569.585
SMILESCCN1[C@H]([C@@H](CCN2CCC(CC2)c2ccccc2[S@](C)=O)c2ccc(Cl)c(Cl)c2)c2ccccc2C1=O