Reaction Details
TargetP2X purinoceptor 7
LigandBDBM50118221
Substrate/Competitorn/a
Meas. Tech.ChEMBL_147420 (CHEMBL754454)
EC50>100000±n/a nM
Citation Jacobson, KAJarvis, MFWilliams, M Purine and pyrimidine (P2) receptors as drug targets. J Med Chem45:4057-93 (2002) P2X purinoceptor 7
Name:P2X purinoceptor 7
Type:Protein
Mol. Mass.:68602.85
Organism:Homo sapiens (Human)
Description:Q99572
Residue:595
BDBM50118221
NameBDBM50118221
Synonyms:9H-purine derivative DIPHOSPHOMETHYLPHOSPHONIC ACID ADENOSYL ESTER | alpha,beta-meATP
TypeSmall organic molecule
Emp. Form.C11H18N5O12P3
Mol. Mass.505.2082
SMILESNc1ncnc2n(cnc12)[C@@H]1O[C@H](COP(O)(=O)CP(O)(=O)OP(O)(O)=O)[C@@H](O)[C@H]1O