Reaction Details
TargetP2X purinoceptor 3
LigandBDBM50118214
Substrate/Competitorn/a
Meas. Tech.ChEMBL_149722 (CHEMBL754042)
IC50 1000±n/a nM
Citation Jacobson, KAJarvis, MFWilliams, M Purine and pyrimidine (P2) receptors as drug targets. J Med Chem45:4057-93 (2002) P2X purinoceptor 3
Name:P2X purinoceptor 3
Type:Protein
Mol. Mass.:44292.02
Organism:Homo sapiens (Human)
Description:P56373
Residue:397
BDBM50118214
NameBDBM50118214
Synonyms:CHEMBL133930 | DIDS
TypeSmall organic molecule
Emp. Form.C16H8N2O6S4
Mol. Mass.452.506
SMILES[O-]S(=O)(=O)c1cc(ccc1\C=C\c1ccc(cc1S([O-])(=O)=O)N=C=S)N=C=S