Reaction Details
TargetP2Y purinoceptor 1
LigandBDBM50118211
Substrate/Competitorn/a
Meas. Tech.ChEMBL_147572 (CHEMBL751769)
IC50 3000±n/a nM
Citation Jacobson, KAJarvis, MFWilliams, M Purine and pyrimidine (P2) receptors as drug targets. J Med Chem45:4057-93 (2002) P2Y purinoceptor 1
Name:P2Y purinoceptor 1
Type:Enzyme
Mol. Mass.:42090.25
Organism:Homo sapiens (Human)
Description:P47900
Residue:373
BDBM50118211
NameBDBM50118211
Synonyms:Acid Blue 129 cid_23675739 | sodium 1-amino-4-(mesitylamino)-9,10-dioxo-9,10-dihydroanthracene-2-sulfonate
TypeSmall organic molecule
Emp. Form.C23H19N2O5S
Mol. Mass.435.473
SMILESCc1cc(C)c(Nc2cc(c(N)c3C(=O)c4ccccc4C(=O)c23)S([O-])(=O)=O)c(C)c1