Reaction Details
TargetP2Y purinoceptor 11
LigandBDBM50118223
Substrate/Competitorn/a
Meas. Tech.ChEMBL_147737 (CHEMBL755048)
EC50 1500±n/a nM
Citation Jacobson, KAJarvis, MFWilliams, M Purine and pyrimidine (P2) receptors as drug targets. J Med Chem45:4057-93 (2002) P2Y purinoceptor 11
Name:P2Y purinoceptor 11
Type:PROTEIN
Mol. Mass.:40366.02
Organism:Homo sapiens (Human)
Description:ChEMBL_1362532
Residue:374
BDBM50118223
NameBDBM50118223
Synonyms:AR-C67085 CHEMBL336292 | CHEMBL369928
TypeSmall organic molecule
Emp. Form.C14H22Cl2N5O12P3S
Mol. Mass.648.243
SMILESCCCSc1nc(N)c2ncn([C@@H]3O[C@H](COP(O)(=O)OP(O)(=O)C(Cl)(Cl)P(O)(O)=O)[C@@H](O)[C@H]3O)c2n1