Reaction Details
TargetP2Y purinoceptor 2
LigandBDBM50366943
Substrate/Competitorn/a
Meas. Tech.ChEMBL_147569 (CHEMBL751766)
IC50 171000±n/a nM
Citation Jacobson, KAJarvis, MFWilliams, M Purine and pyrimidine (P2) receptors as drug targets. J Med Chem45:4057-93 (2002) P2Y purinoceptor 2
Name:P2Y purinoceptor 2
Type:PROTEIN
Mol. Mass.:42299.21
Organism:Homo sapiens (Human)
Description:ChEMBL_1455361
Residue:377
BDBM50366943
NameBDBM50366943
Synonyms:TRYPAN BLUE
TypeSmall organic molecule
Emp. Form.C34H24N6O14S4
Mol. Mass.868.848
SMILESCc1cc(ccc1N=Nc1c(O)c2c(N)cc(cc2cc1S([O-])(=O)=O)S([O-])(=O)=O)-c1ccc(N=Nc2c(O)c3c(N)cc(cc3cc2S([O-])(=O)=O)S([O-])(=O)=O)c(C)c1