Reaction Details
TargetP2X purinoceptor 2
LigandBDBM50370141
Substrate/Competitorn/a
Meas. Tech.ChEMBL_149740 (CHEMBL759523)
EC50 2000±n/a nM
Citation Jacobson, KAJarvis, MFWilliams, M Purine and pyrimidine (P2) receptors as drug targets. J Med Chem45:4057-93 (2002) P2X purinoceptor 2
Name:P2X purinoceptor 2
Type:Enzyme Catalytic Domain
Mol. Mass.:51765.18
Organism:Homo sapiens (Human)
Description:PurinergicP2X2/3 0 HUMAN::Q9UBL9
Residue:471
BDBM50370141
NameBDBM50370141
Synonyms:TNP-ATP
TypeSmall organic molecule
Emp. Form.C16H16N8O19P3
Mol. Mass.717.2623
SMILESNc1ncnc2n(cnc12)C1OC(COP(O)(=O)OP(O)(=O)OP(O)(O)=O)C2OC3(OC12)C(=C[C-](C=C3[N+]([O-])=O)[N+]([O-])=O)[N+]([O-])=O