Reaction Details
TargetP2X purinoceptor 6
LigandBDBM50118219
Substrate/Competitorn/a
Meas. Tech.ChEMBL_147418 (CHEMBL750992)
EC50 25000±n/a nM
Citation Jacobson, KAJarvis, MFWilliams, M Purine and pyrimidine (P2) receptors as drug targets. J Med Chem45:4057-93 (2002) P2X purinoceptor 6
Name:P2X purinoceptor 6
Type:PROTEIN
Mol. Mass.:48834.61
Organism:Homo sapiens (Human)
Description:ChEMBL_612726
Residue:441
BDBM50118219
NameBDBM50118219
Synonyms:Bz-ATP | CHEMBL339386
TypeSmall organic molecule
Emp. Form.C23H24N5O14P3
Mol. Mass.687.383
SMILESNc1ncnc2n(cnc12)[C@@H]1O[C@H](COP(O)(=O)OP(O)(=O)OP(O)(O)=O)[C@@H](O)[C@H]1OC(=O)c1ccc(cc1)-c1ccccc1