Reaction Details
TargetP2X purinoceptor 3
LigandBDBM85043
Substrate/Competitorn/a
Meas. Tech.ChEMBL_147403 (CHEMBL884064)
EC50 1700±n/a nM
Citation Jacobson, KAJarvis, MFWilliams, M Purine and pyrimidine (P2) receptors as drug targets. J Med Chem45:4057-93 (2002) P2X purinoceptor 3
Name:P2X purinoceptor 3
Type:Protein
Mol. Mass.:44292.02
Organism:Homo sapiens (Human)
Description:P56373
Residue:397
BDBM85043
NameBDBM85043
Synonyms:CAS_149017-66-3 NSC_6093163 | PPADS
TypeSmall organic molecule
Emp. Form.C14H14N3O12PS2
Mol. Mass.511.378
SMILESCc1nc(N=Nc2ccc(cc2S(O)(=O)=O)S(O)(=O)=O)c(COP(O)(O)=O)c(C=O)c1O