Reaction Details
TargetP2Y purinoceptor 6
LigandBDBM50118232
Substrate/Competitorn/a
Meas. Tech.ChEMBL_147883 (CHEMBL757045)
EC50 100000±n/a nM
Citation Jacobson, KAJarvis, MFWilliams, M Purine and pyrimidine (P2) receptors as drug targets. J Med Chem45:4057-93 (2002) P2Y purinoceptor 6
Name:P2Y purinoceptor 6
Type:PROTEIN
Mol. Mass.:36452.29
Organism:Homo sapiens (Human)
Description:ChEMBL_1511151
Residue:328
BDBM50118232
NameBDBM50118232
Synonyms:2-MeSATP CHEMBL336208
TypeSmall organic molecule
Emp. Form.C11H18N5O13P3S
Mol. Mass.553.273
SMILESCSc1nc(N)c2ncn([C@@H]3O[C@H](COP(O)(=O)OP(O)(=O)OP(O)(O)=O)[C@@H](O)[C@H]3O)c2n1