Reaction Details
TargetP2X purinoceptor 3
LigandBDBM50118220
Substrate/Competitorn/a
Meas. Tech.ChEMBL_147403 (CHEMBL884064)
EC50 500±n/a nM
Citation Jacobson, KAJarvis, MFWilliams, M Purine and pyrimidine (P2) receptors as drug targets. J Med Chem45:4057-93 (2002) P2X purinoceptor 3
Name:P2X purinoceptor 3
Type:Protein
Mol. Mass.:44292.02
Organism:Homo sapiens (Human)
Description:P56373
Residue:397
BDBM50118220
NameBDBM50118220
Synonyms:(ppA)2 CHEMBL339385 adenosine(5')tetraphospho(5')adenosine | bis(5'-adenylyl) diphosphate
TypeSmall organic molecule
Emp. Form.C20H28N10O19P4
Mol. Mass.836.387
SMILESNc1ncnc2n(cnc12)[C@@H]1O[C@H](COP(O)(=O)OP(O)(=O)OP(O)(=O)OP(O)(=O)OC[C@H]2O[C@H]([C@H](O)[C@@H]2O)n2cnc3c(N)ncnc23)[C@@H](O)[C@H]1O