Reaction Details
TargetP2X purinoceptor 1
LigandBDBM50064803
Substrate/Competitorn/a
Meas. Tech.ChEMBL_149730 (CHEMBL759513)
EC50 10200±n/a nM
Citation Jacobson, KAJarvis, MFWilliams, M Purine and pyrimidine (P2) receptors as drug targets. J Med Chem45:4057-93 (2002) P2X purinoceptor 1
Name:P2X purinoceptor 1
Type:Enzyme Catalytic Domain
Mol. Mass.:44969.95
Organism:RAT
Description:Purinergic, P2X1 0 RAT::P47824
Residue:399
BDBM50064803
NameBDBM50064803
Synonyms:3-Methyl-7-oxo-5,9-dihydro-6,8-dioxa-2-aza-7lambda*5*-phospha-benzocycloheptene-4,7-diol MRS 2220
TypeSmall organic molecule
Emp. Form.C8H10NO5P
Mol. Mass.231.1425
SMILESCc1ncc2COP(O)(=O)OCc2c1O