Reaction Details
TargetP2X purinoceptor 3
LigandBDBM50064800
Substrate/Competitorn/a
Meas. Tech.ChEMBL_147400 (CHEMBL751808)
IC50 84±n/a nM
Citation Jacobson, KAJarvis, MFWilliams, M Purine and pyrimidine (P2) receptors as drug targets. J Med Chem45:4057-93 (2002) P2X purinoceptor 3
Name:P2X purinoceptor 3
Type:Protein
Mol. Mass.:44292.02
Organism:Homo sapiens (Human)
Description:P56373
Residue:397
BDBM50064800
NameBDBM50064800
Synonyms:2-(4-Formyl-5-hydroxy-6-methyl-3-phosphonooxymethyl-pyridin-2-ylazo)-benzene-1,4-disulfonic acid isoPPADS | pyridoxal-alpha5-phosphate-6-azophenyl-2',5'-disulfonic acid
TypeSmall organic molecule
Emp. Form.C14H14N3O12PS2
Mol. Mass.511.378
SMILESCc1nc(N=Nc2cc(ccc2S(O)(=O)=O)S(O)(=O)=O)c(COP(O)(O)=O)c(C=O)c1O