Reaction Details
TargetP2X purinoceptor 6
LigandBDBM50368125
Substrate/Competitorn/a
Meas. Tech.ChEMBL_147419 (CHEMBL750993)
EC50 11000±n/a nM
Citation Jacobson, KAJarvis, MFWilliams, M Purine and pyrimidine (P2) receptors as drug targets. J Med Chem45:4057-93 (2002) P2X purinoceptor 6
Name:P2X purinoceptor 6
Type:PROTEIN
Mol. Mass.:42451.11
Organism:Rattus norvegicus
Description:ChEMBL_147419
Residue:379
BDBM50368125
NameBDBM50368125
Synonyms:ADENOSINE DIPHOSPHATE | ADP
TypeSmall organic molecule
Emp. Form.C10H15N5O10P2
Mol. Mass.427.2011
SMILESNc1ncnc2n(cnc12)[C@@H]1O[C@H](CO[P@@](O)(=O)OP(O)(O)=O)[C@@H](O)[C@H]1O