Reaction Details
TargetP2X purinoceptor 4
LigandBDBM50118229
Substrate/Competitorn/a
Meas. Tech.ChEMBL_147412 (CHEMBL750986)
EC50>10000±n/a nM
Citation Jacobson, KAJarvis, MFWilliams, M Purine and pyrimidine (P2) receptors as drug targets. J Med Chem45:4057-93 (2002) P2X purinoceptor 4
Name:P2X purinoceptor 4
Type:Enzyme Catalytic Domain
Mol. Mass.:43504.16
Organism:RAT
Description:Purinergic, P2X4 0 RAT::P51577
Residue:388
BDBM50118229
NameBDBM50118229
Synonyms:CHEMBL129841 | MRS 2179
TypeSmall organic molecule
Emp. Form.C11H17N5O9P2
Mol. Mass.425.2283
SMILESCNc1ncnc2n(cnc12)[C@H]1C[C@H](OP(O)(O)=O)[C@@H](COP(O)(O)=O)O1