Reaction Details
TargetP2X purinoceptor 3
LigandBDBM50118221
Substrate/Competitorn/a
Meas. Tech.ChEMBL_147403 (CHEMBL884064)
EC50 740±n/a nM
Citation Jacobson, KAJarvis, MFWilliams, M Purine and pyrimidine (P2) receptors as drug targets. J Med Chem45:4057-93 (2002) P2X purinoceptor 3
Name:P2X purinoceptor 3
Type:Protein
Mol. Mass.:44292.02
Organism:Homo sapiens (Human)
Description:P56373
Residue:397
BDBM50118221
NameBDBM50118221
Synonyms:9H-purine derivative DIPHOSPHOMETHYLPHOSPHONIC ACID ADENOSYL ESTER | alpha,beta-meATP
TypeSmall organic molecule
Emp. Form.C11H18N5O12P3
Mol. Mass.505.2082
SMILESNc1ncnc2n(cnc12)[C@@H]1O[C@H](COP(O)(=O)CP(O)(=O)OP(O)(O)=O)[C@@H](O)[C@H]1O