Reaction Details
TargetP2X purinoceptor 3
LigandBDBM50366480
Substrate/Competitorn/a
Meas. Tech.ChEMBL_147403 (CHEMBL884064)
EC50 340±n/a nM
Citation Jacobson, KAJarvis, MFWilliams, M Purine and pyrimidine (P2) receptors as drug targets. J Med Chem45:4057-93 (2002) P2X purinoceptor 3
Name:P2X purinoceptor 3
Type:Protein
Mol. Mass.:44292.02
Organism:Homo sapiens (Human)
Description:P56373
Residue:397
BDBM50366480
NameBDBM50366480
Synonyms:ADENOSINE TRIPHOSPHATE | ATP
TypeSmall organic molecule
Emp. Form.C10H16N5O13P3
Mol. Mass.507.181
SMILESNc1ncnc2n(cnc12)[C@@H]1O[C@H](CO[P@](O)(=O)O[P@@](O)(=O)OP(O)(O)=O)[C@@H](O)[C@H]1O