Reaction Details
TargetcGMP-specific 3',5'-cyclic phosphodiesterase
LigandBDBM50118257
Substrate/Competitorn/a
Meas. Tech.ChEMBL_155351 (CHEMBL762496)
Ki 1.1±n/a nM
Citation Sui, ZGuan, JMacielag, MJJiang, WZhang, SQiu, YKraft, PBhattacharjee, SJohn, TMHaynes-Johnson, DClancy, J Pyrimidinylpyrroloquinolones as highly potent and selective PDE5 inhibitors for treatment of erectile dysfunction. J Med Chem45:4094-6 (2002) cGMP-specific 3',5'-cyclic phosphodiesterase
Name:cGMP-specific 3',5'-cyclic phosphodiesterase
Type:Protein
Mol. Mass.:99975.83
Organism:Homo sapiens (Human)
Description:O76074
Residue:875
BDBM50118257
NameBDBM50118257
Synonyms:3-(2,3-Dihydro-benzofuran-5-yl)-2-pyrimidin-2-yl-1,2,3,4-tetrahydro-pyrrolo[3,4-b]quinolin-9-one | CHEMBL132689
TypeSmall organic molecule
Emp. Form.C23H18N4O2
Mol. Mass.382.4146
SMILESOc1c2CN(C(c2nc2ccccc12)c1ccc2OCCc2c1)c1ncccn1