Reaction Details
TargetcGMP-specific 3',5'-cyclic phosphodiesterase
LigandBDBM50118249
Substrate/Competitorn/a
Meas. Tech.ChEMBL_155351 (CHEMBL762496)
Ki 0.210000±n/a nM
Citation Sui, ZGuan, JMacielag, MJJiang, WZhang, SQiu, YKraft, PBhattacharjee, SJohn, TMHaynes-Johnson, DClancy, J Pyrimidinylpyrroloquinolones as highly potent and selective PDE5 inhibitors for treatment of erectile dysfunction. J Med Chem45:4094-6 (2002) cGMP-specific 3',5'-cyclic phosphodiesterase
Name:cGMP-specific 3',5'-cyclic phosphodiesterase
Type:Protein
Mol. Mass.:99975.83
Organism:Homo sapiens (Human)
Description:O76074
Residue:875
BDBM50118249
NameBDBM50118249
Synonyms:3-(2,3-Dihydro-benzofuran-5-yl)-2-[5-(3,4-dimethoxy-phenyl)-pyrimidin-2-yl]-1,2,3,4-tetrahydro-pyrrolo[3,4-b]quinolin-9-one | CHEMBL336815
TypeSmall organic molecule
Emp. Form.C31H26N4O4
Mol. Mass.518.5625
SMILESCOc1ccc(cc1OC)-c1cnc(nc1)N1Cc2c(nc3ccccc3c2O)C1c1ccc2OCCc2c1