Reaction Details
TargetcGMP-specific 3',5'-cyclic phosphodiesterase
LigandBDBM50118251
Substrate/Competitorn/a
Meas. Tech.ChEMBL_155351 (CHEMBL762496)
Ki 0.520000±n/a nM
Citation Sui, ZGuan, JMacielag, MJJiang, WZhang, SQiu, YKraft, PBhattacharjee, SJohn, TMHaynes-Johnson, DClancy, J Pyrimidinylpyrroloquinolones as highly potent and selective PDE5 inhibitors for treatment of erectile dysfunction. J Med Chem45:4094-6 (2002) cGMP-specific 3',5'-cyclic phosphodiesterase
Name:cGMP-specific 3',5'-cyclic phosphodiesterase
Type:Protein
Mol. Mass.:99975.83
Organism:Homo sapiens (Human)
Description:O76074
Residue:875
BDBM50118251
NameBDBM50118251
Synonyms:3-(2,3-Dihydro-benzo[1,4]dioxin-6-yl)-2-[5-(4-methoxy-phenyl)-pyrimidin-2-yl]-1,2,3,4-tetrahydro-pyrrolo[3,4-b]quinolin-9-one | CHEMBL131892
TypeSmall organic molecule
Emp. Form.C30H24N4O4
Mol. Mass.504.536
SMILESCOc1ccc(cc1)-c1cnc(nc1)N1Cc2c(nc3ccccc3c2O)C1c1ccc2OCCOc2c1