Reaction Details
TargetcGMP-specific 3',5'-cyclic phosphodiesterase
LigandBDBM50118256
Substrate/Competitorn/a
Meas. Tech.ChEMBL_155351 (CHEMBL762496)
Ki 1.1±n/a nM
Citation Sui, ZGuan, JMacielag, MJJiang, WZhang, SQiu, YKraft, PBhattacharjee, SJohn, TMHaynes-Johnson, DClancy, J Pyrimidinylpyrroloquinolones as highly potent and selective PDE5 inhibitors for treatment of erectile dysfunction. J Med Chem45:4094-6 (2002) cGMP-specific 3',5'-cyclic phosphodiesterase
Name:cGMP-specific 3',5'-cyclic phosphodiesterase
Type:Protein
Mol. Mass.:99975.83
Organism:Homo sapiens (Human)
Description:O76074
Residue:875
BDBM50118256
NameBDBM50118256
Synonyms:2-[5-(3,4-Dimethoxy-phenyl)-pyrimidin-2-yl]-3-indan-5-yl-1,2,3,4-tetrahydro-pyrrolo[3,4-b]quinolin-9-one | CHEMBL336291
TypeSmall organic molecule
Emp. Form.C32H28N4O3
Mol. Mass.516.5897
SMILESCOc1ccc(cc1OC)-c1cnc(nc1)N1Cc2c(nc3ccccc3c2O)C1c1ccc2CCCc2c1