Reaction Details
TargetSodium-dependent dopamine transporter
LigandBDBM50118262
Substrate/Competitorn/a
Meas. Tech.ChEMBL_61524 (CHEMBL675649)
Ki 36.2±n/a nM
Citation Houlihan, WJKelly, LPankuch, JKoletar, JBrand, LJanowsky, AKopajtic, TA Mazindol analogues as potential inhibitors of the cocaine binding site at the dopamine transporter. J Med Chem45:4097-109 (2002) Sodium-dependent dopamine transporter
Name:Sodium-dependent dopamine transporter
Type:Multi-pass membrane protein
Mol. Mass.:68497.11
Organism:Homo sapiens (Human)
Description:Q01959
Residue:620
BDBM50118262
NameBDBM50118262
Synonyms:9-(4-Methoxy-phenyl)-1,2,3,9-tetrahydro-4,9a-diaza-fluoren-9-ol | CHEMBL133043
TypeSmall organic molecule
Emp. Form.C18H18N2O2
Mol. Mass.294.3477
SMILESCOc1ccc(cc1)C1(O)N2CCCN=C2c2ccccc12