Reaction Details
TargetSodium-dependent serotonin transporter
LigandBDBM50118272
Substrate/Competitorn/a
Meas. Tech.ChEMBL_201363 (CHEMBL805346)
Ki 38.10±n/a nM
Citation Houlihan, WJKelly, LPankuch, JKoletar, JBrand, LJanowsky, AKopajtic, TA Mazindol analogues as potential inhibitors of the cocaine binding site at the dopamine transporter. J Med Chem45:4097-109 (2002) Sodium-dependent serotonin transporter
Name:Sodium-dependent serotonin transporter
Type:Multi-pass membrane protein
Mol. Mass.:70322.51
Organism:Homo sapiens (Human)
Description:P31645
Residue:630
BDBM50118272
NameBDBM50118272
Synonyms:5-(4-Chloro-phenyl)-9-fluoro-2,5-dihydro-3H-imidazo[2,1-a]isoindol-5-ol | CHEMBL336100
TypeSmall organic molecule
Emp. Form.C16H12ClFN2O
Mol. Mass.302.731
SMILESOC1(N2CCN=C2c2c1cccc2F)c1ccc(Cl)cc1