Reaction Details
TargetSodium-dependent dopamine transporter
LigandBDBM50118265
Substrate/Competitorn/a
Meas. Tech.ChEMBL_61524 (CHEMBL675649)
Ki 2.9±n/a nM
Citation Houlihan, WJKelly, LPankuch, JKoletar, JBrand, LJanowsky, AKopajtic, TA Mazindol analogues as potential inhibitors of the cocaine binding site at the dopamine transporter. J Med Chem45:4097-109 (2002) Sodium-dependent dopamine transporter
Name:Sodium-dependent dopamine transporter
Type:Multi-pass membrane protein
Mol. Mass.:68497.11
Organism:Homo sapiens (Human)
Description:Q01959
Residue:620
BDBM50118265
NameBDBM50118265
Synonyms:5-(4-Chloro-phenyl)-9-methoxy-2,5-dihydro-3H-imidazo[2,1-a]isoindol-5-ol | CHEMBL336940
TypeSmall organic molecule
Emp. Form.C17H15ClN2O2
Mol. Mass.314.766
SMILESCOc1cccc2c1C1=NCCN1C2(O)c1ccc(Cl)cc1