Reaction Details
TargetSodium-dependent dopamine transporter
LigandBDBM50118266
Substrate/Competitorn/a
Meas. Tech.ChEMBL_61524 (CHEMBL675649)
Ki 2.55±n/a nM
Citation Houlihan, WJKelly, LPankuch, JKoletar, JBrand, LJanowsky, AKopajtic, TA Mazindol analogues as potential inhibitors of the cocaine binding site at the dopamine transporter. J Med Chem45:4097-109 (2002) Sodium-dependent dopamine transporter
Name:Sodium-dependent dopamine transporter
Type:Multi-pass membrane protein
Mol. Mass.:68497.11
Organism:Homo sapiens (Human)
Description:Q01959
Residue:620
BDBM50118266
NameBDBM50118266
Synonyms:9-Benzo[1,3]dioxol-5-yl-1,2,3,9-tetrahydro-4,9a-diaza-fluoren-9-ol; hydrochloride | CHEMBL544370
TypeSmall organic molecule
Emp. Form.C18H16N2O3
Mol. Mass.308.3312
SMILESOC1(N2CCCN=C2c2ccccc12)c1ccc2OCOc2c1