Reaction Details
TargetSodium-dependent noradrenaline transporter
LigandBDBM50118266
Substrate/Competitorn/a
Meas. Tech.ChEMBL_142607 (CHEMBL751146)
Ki 8.80±n/a nM
Citation Houlihan, WJKelly, LPankuch, JKoletar, JBrand, LJanowsky, AKopajtic, TA Mazindol analogues as potential inhibitors of the cocaine binding site at the dopamine transporter. J Med Chem45:4097-109 (2002) Sodium-dependent noradrenaline transporter
Name:Sodium-dependent noradrenaline transporter
Type:Multi-pass membrane protein
Mol. Mass.:69337.72
Organism:Homo sapiens (Human)
Description:P23975
Residue:617
BDBM50118266
NameBDBM50118266
Synonyms:9-Benzo[1,3]dioxol-5-yl-1,2,3,9-tetrahydro-4,9a-diaza-fluoren-9-ol; hydrochloride | CHEMBL544370
TypeSmall organic molecule
Emp. Form.C18H16N2O3
Mol. Mass.308.3312
SMILESOC1(N2CCCN=C2c2ccccc12)c1ccc2OCOc2c1