Reaction Details
TargetThymidine kinase, cytosolic
LigandBDBM1
Substrate/Competitorn/a
Meas. Tech.ChEMBL_208016 (CHEMBL814145)
IC50 16±n/a nM
Citation Hernández, AIBalzarini, JKarlsson, ACamarasa, MJPérez-Pérez, MJ Acyclic nucleoside analogues as novel inhibitors of human mitochondrial thymidine kinase. J Med Chem45:4254-63 (2002) Thymidine kinase, cytosolic
Name:Thymidine kinase, cytosolic
Type:PROTEIN
Mol. Mass.:25476.50
Organism:Homo sapiens (Human)
Description:ChEMBL_1333884
Residue:234
BDBM1
NameBDBM1
Synonyms:dT | thymidine
TypeNucleoside or nucleotide
Emp. Form.C10H14N2O5
Mol. Mass.242.2286
SMILESCc1cn([C@H]2C[C@H](O)[C@@H](CO)O2)c(=O)[nH]c1=O