Reaction Details
TargetThymidine kinase, cytosolic
LigandBDBM50118499
Substrate/Competitorn/a
Meas. Tech.ChEMBL_208013 (CHEMBL816093)
IC50 14000±n/a nM
Citation Hernández, AIBalzarini, JKarlsson, ACamarasa, MJPérez-Pérez, MJ Acyclic nucleoside analogues as novel inhibitors of human mitochondrial thymidine kinase. J Med Chem45:4254-63 (2002) Thymidine kinase, cytosolic
Name:Thymidine kinase, cytosolic
Type:PROTEIN
Mol. Mass.:25476.50
Organism:Homo sapiens (Human)
Description:ChEMBL_1333884
Residue:234
BDBM50118499
NameBDBM50118499
Synonyms:1-{5-[Bis-(4-methoxy-phenyl)-phenyl-methoxymethyl]-4-hydroxy-tetrahydro-furan-2-yl}-5-methyl-1H-pyrimidine-2,4-dione | CHEMBL336551
TypeSmall organic molecule
Emp. Form.C31H32N2O7
Mol. Mass.544.595
SMILESCOc1ccc(cc1)C(OCC1OC(CC1O)n1cc(C)c(=O)[nH]c1=O)(c1ccccc1)c1ccc(OC)cc1