Reaction Details
TargetThymidine kinase, cytosolic
LigandBDBM50118491
Substrate/Competitorn/a
Meas. Tech.ChEMBL_81438 (CHEMBL690903)
IC50 390±n/a nM
Citation Hernández, AIBalzarini, JKarlsson, ACamarasa, MJPérez-Pérez, MJ Acyclic nucleoside analogues as novel inhibitors of human mitochondrial thymidine kinase. J Med Chem45:4254-63 (2002) Thymidine kinase, cytosolic
Name:Thymidine kinase, cytosolic
Type:PROTEIN
Mol. Mass.:25476.50
Organism:Homo sapiens (Human)
Description:ChEMBL_1333884
Residue:234
BDBM50118491
NameBDBM50118491
Synonyms:5-Methyl-1-(4-trityloxy-but-2-enyl)-1H-pyrimidine-2,4-dione | CHEMBL422810
TypeSmall organic molecule
Emp. Form.C28H26N2O3
Mol. Mass.438.5176
SMILESCc1cn(C\C=C\COC(c2ccccc2)(c2ccccc2)c2ccccc2)c(=O)[nH]c1=O