Reaction Details
TargetThymidine kinase, cytosolic
LigandBDBM50118504
Substrate/Competitorn/a
Meas. Tech.ChEMBL_210617 (CHEMBL811734)
IC50 22000±n/a nM
Citation Hernández, AIBalzarini, JKarlsson, ACamarasa, MJPérez-Pérez, MJ Acyclic nucleoside analogues as novel inhibitors of human mitochondrial thymidine kinase. J Med Chem45:4254-63 (2002) Thymidine kinase, cytosolic
Name:Thymidine kinase, cytosolic
Type:PROTEIN
Mol. Mass.:25476.50
Organism:Homo sapiens (Human)
Description:ChEMBL_1333884
Residue:234
BDBM50118504
NameBDBM50118504
Synonyms:1-(4-Benzyloxy-but-2-enyl)-5-methyl-1H-pyrimidine-2,4-dione | CHEMBL132921
TypeSmall organic molecule
Emp. Form.C16H18N2O3
Mol. Mass.286.3257
SMILESCc1cn(C\C=C/COCc2ccccc2)c(=O)[nH]c1=O