Reaction Details
TargetCarbonic anhydrase 2
LigandBDBM11427
Substrate/Competitorn/a
Meas. Tech.ChEMBL_45048 (CHEMBL658046)
Ki 4±n/a nM
Citation Masereel, BRolin, SAbbate, FScozzafava, ASupuran, CT Carbonic anhydrase inhibitors: anticonvulsant sulfonamides incorporating valproyl and other lipophilic moieties. J Med Chem45:312-20 (2002) Carbonic anhydrase 2
Name:Carbonic anhydrase 2
Type:Enzyme
Mol. Mass.:29250.71
Organism:Homo sapiens (Human)
Description:P00918
Residue:260
BDBM11427
NameBDBM11427
Synonyms:2-N-(4-methylbenzene)-1,3,4-thiadiazole-2,5-disulfonamido CHEMBL108380 | Methylbenzolamide
TypeSmall organic molecule
Emp. Form.C9H10N4O4S3
Mol. Mass.334.395
SMILESCc1ccc(cc1)S(=O)(=O)Nc1nnc(s1)S(N)(=O)=O