Reaction Details
TargetD(3) dopamine receptor
LigandBDBM50108593
Substrate/Competitorn/a
Meas. Tech.ChEMBL_62766 (CHEMBL676293)
Ki 19.4±n/a nM
Citation Campiani, GButini, SGemma, SNacci, VFattorusso, CCatalanotti, BGiorgi, GCagnotto, AGoegan, MMennini, TMinetti, PDi Cesare, MAMastroianni, DScafetta, NGalletti, BStasi, MACastorina, MPacifici, LGhirardi, OTinti, OCarminati, P Pyrrolo[1,3]benzothiazepine-based atypical antipsychotic agents. Synthesis, structure-activity relationship, molecular modeling, and biological studies. J Med Chem45:344-59 (2002) D(3) dopamine receptor
Name:D(3) dopamine receptor
Type:Protein
Mol. Mass.:49540.58
Organism:Rattus norvegicus (Rat)
Description:P19020
Residue:446
BDBM50108593
NameBDBM50108593
Synonyms:(+/-)7-Fluoro-9-(4-methyl-piperazin-1-yl)-9,10-dihydro-4-thia-10a-aza-benzo[f]azulene (S)-(+)7-Fluoro-9-(4-methyl-piperazin-1-yl)-9,10-dihydro-4-thia-10a-aza-benzo[f]azulene(ST1615) | CHEMBL332600
TypeSmall organic molecule
Emp. Form.C17H20FN3S
Mol. Mass.317.424
SMILESCN1CCN(CC1)C1Cn2cccc2Sc2ccc(F)cc12