Reaction Details
TargetD(2) dopamine receptor
LigandBDBM50007567
Substrate/Competitorn/a
Meas. Tech.ChEMBL_62710 (CHEMBL675803)
Ki 3.6±n/a nM
Citation Campiani, GButini, SGemma, SNacci, VFattorusso, CCatalanotti, BGiorgi, GCagnotto, AGoegan, MMennini, TMinetti, PDi Cesare, MAMastroianni, DScafetta, NGalletti, BStasi, MACastorina, MPacifici, LGhirardi, OTinti, OCarminati, P Pyrrolo[1,3]benzothiazepine-based atypical antipsychotic agents. Synthesis, structure-activity relationship, molecular modeling, and biological studies. J Med Chem45:344-59 (2002) D(2) dopamine receptor
Name:D(2) dopamine receptor
Type:G Protein-Coupled Receptor (GPCR)
Mol. Mass.:50931.60
Organism:Rattus norvegicus (rat)
Description:P61169
Residue:444
BDBM50007567
NameBDBM50007567
Synonyms:1-(8-Chloro-10,11-dihydro-dibenzo[b,f]thiepin-10-yl)-4-methyl-piperazine OCTOCLOTHEPIN-R
TypeSmall organic molecule
Emp. Form.C19H21ClN2S
Mol. Mass.344.901
SMILESCN1CCN(CC1)[C@@H]1Cc2ccccc2Sc2ccc(Cl)cc12