Reaction Details
TargetD(3) dopamine receptor
LigandBDBM50108597
Substrate/Competitorn/a
Meas. Tech.ChEMBL_62766 (CHEMBL676293)
Ki 7.4±n/a nM
Citation Campiani, GButini, SGemma, SNacci, VFattorusso, CCatalanotti, BGiorgi, GCagnotto, AGoegan, MMennini, TMinetti, PDi Cesare, MAMastroianni, DScafetta, NGalletti, BStasi, MACastorina, MPacifici, LGhirardi, OTinti, OCarminati, P Pyrrolo[1,3]benzothiazepine-based atypical antipsychotic agents. Synthesis, structure-activity relationship, molecular modeling, and biological studies. J Med Chem45:344-59 (2002) D(3) dopamine receptor
Name:D(3) dopamine receptor
Type:Protein
Mol. Mass.:49540.58
Organism:Rattus norvegicus (Rat)
Description:P19020
Residue:446
BDBM50108597
NameBDBM50108597
Synonyms:(+/-)7-Bromo-9-(4-ethyl-piperazin-1-yl)-9,10-dihydro-4-thia-10a-aza-benzo[f]azulene | CHEMBL333955
TypeSmall organic molecule
Emp. Form.C18H22BrN3S
Mol. Mass.392.356
SMILESCCN1CCN(CC1)C1Cn2cccc2Sc2ccc(Br)cc12